Target
Tyrosine-protein kinase Lck
Ligand
BDBM50097395
Substrate
Meas. Tech.
ChEMBL_1501898 (CHEMBL3588238)
IC50
6400±n/a nM
Citation
 Smith, CRDougan, DRKomandla, MKanouni, TKnight, BLawson, JDSabat, MTaylor, ERVu, PWyrick, C Fragment-Based Discovery of a Small Molecule Inhibitor of Bruton's Tyrosine Kinase. J Med Chem 58:5437-44 (2015)  
Target
Name:
Tyrosine-protein kinase Lck
Synonyms:
2.7.10.2 LCK_HUMAN Leukocyte C-terminal Src kinase Lymphocyte-specific protein tyrosine kinase Protein YT16 Proto-oncogene tyrosine-protein kinase LCK T cell-specific protein-tyrosine kinase
Type:
Mol. Mass.:
57987.83
Organism:
Homo sapiens (Human)
Description:
P06239
Residue:
509
  
Inhibitor
Name:
BDBM50097395
Synonyms:
CHEMBL3586445
Type:
Small organic molecule
Emp. Form.:
C17H13N5O
Mol. Mass.:
303.318
SMILES:
NC(=O)c1nnc2c(cccc2c1N)-c1ccc2cc[nH]c2c1
: