Target
Alpha-2C adrenergic receptor
Ligand
BDBM50001922
Substrate
Meas. Tech.
ChEMBL_1504524 (CHEMBL3591120)
EC50
55±n/a nM
Citation
 Szollosi, EBobok, AKiss, LVass, MKurkó, DKolok, SVisegrády, AKeseru, GM Cell-based and virtual fragment screening for adrenergica2C receptor agonists. Bioorg Med Chem 23:3991-9 (2015)  
Target
Name:
Alpha-2C adrenergic receptor
Synonyms:
ADA2C_HUMAN ADRA2L2 Adrenergic alpha2C Adrenergic receptor alpha Alpha-2 adrenergic receptor subtype C4 Alpha-2C adrenoreceptor | adrenergic, alpha-2C-, receptor [Homo sapiens]
Type:
Enzyme
Mol. Mass.:
49552.32
Organism:
Homo sapiens (Human)
Description:
P18825
Residue:
462
  
Inhibitor
Name:
BDBM50001922
Synonyms:
2-Naphthalen-1-ylmethyl-4,5-dihydro-1H-imidazole; hydrochloride CHEMBL1706 Nafazair Naphazoline Nitrate Opcon cid_11079
Type:
Small organic molecule
Emp. Form.:
C14H14N2
Mol. Mass.:
210.2744
SMILES:
C(C1=NCCN1)c1cccc2ccccc12
: