Target
Alpha-2C adrenergic receptor
Ligand
BDBM50097713
Substrate
Meas. Tech.
ChEMBL_1504523 (CHEMBL3590965)
Ki
22387±n/a nM
Citation
 Szollosi, EBobok, AKiss, LVass, MKurkó, DKolok, SVisegrády, AKeseru, GM Cell-based and virtual fragment screening for adrenergica2C receptor agonists. Bioorg Med Chem 23:3991-9 (2015)  
Target
Name:
Alpha-2C adrenergic receptor
Synonyms:
ADA2C_HUMAN ADRA2L2 Adrenergic alpha2C Adrenergic receptor alpha Alpha-2 adrenergic receptor subtype C4 Alpha-2C adrenoreceptor | adrenergic, alpha-2C-, receptor [Homo sapiens]
Type:
Enzyme
Mol. Mass.:
49552.32
Organism:
Homo sapiens (Human)
Description:
P18825
Residue:
462
  
Inhibitor
Name:
BDBM50097713
Synonyms:
CHEMBL3588911
Type:
Small organic molecule
Emp. Form.:
C15H21N3
Mol. Mass.:
243.3473
SMILES:
CC(C)NCc1nccn1Cc1ccccc1C
: