Target
Plasma kallikrein
Ligand
BDBM50098596
Substrate
Meas. Tech.
ChEMBL_1504788 (CHEMBL3595073)
Ki
50±n/a nM
Citation
 Priestley, ESCheney, DLDeLucca, IWei, ALuettgen, JMRendina, ARWong, PCWexler, RR Structure-Based Design of Macrocyclic Coagulation Factor VIIa Inhibitors. J Med Chem 58:6225-36 (2015)  
Target
Name:
Plasma kallikrein
Synonyms:
Fletcher factor KLKB1 Kallikrein Plasma kallikrein heavy chain Plasma prekallikrein
Type:
Protein
Mol. Mass.:
71391.16
Organism:
Homo sapiens (Human)
Description:
P03952
Residue:
638
  
Inhibitor
Name:
BDBM50098596
Synonyms:
CHEMBL3594313
Type:
Small organic molecule
Emp. Form.:
C28H31N5O4S
Mol. Mass.:
533.642
SMILES:
CCS(=O)(=O)c1ccc2NC(=O)CCCc3ccc(cc3)[C@@H](Nc3ccc(cc3)C(N)=N)C(=O)NCc1c2
: