Target
Vitamin K-dependent protein C
Ligand
BDBM50098591
Substrate
Meas. Tech.
ChEMBL_1504786 (CHEMBL3595071)
Ki
2800±n/a nM
Citation
 Priestley, ESCheney, DLDeLucca, IWei, ALuettgen, JMRendina, ARWong, PCWexler, RR Structure-Based Design of Macrocyclic Coagulation Factor VIIa Inhibitors. J Med Chem 58:6225-36 (2015)  
Target
Name:
Vitamin K-dependent protein C
Synonyms:
Activated protein C cofactor Apolipoprotein H Blood coagulation factor XIV Coagulation factor V heavy chain Endothelial protein C receptor PROC_HUMAN Vitamin K-dependent protein C precursor
Type:
Enzyme
Mol. Mass.:
52067.73
Organism:
Homo sapiens (Human)
Description:
Residue:
461
  
Inhibitor
Name:
BDBM50098591
Synonyms:
CHEMBL3594305
Type:
Small organic molecule
Emp. Form.:
C28H27N5O2
Mol. Mass.:
465.5463
SMILES:
Nc1nccc2cc(N[C@@H]3c4ccc(CCCC(=O)Nc5cccc(CNC3=O)c5)cc4)ccc12
: