Target
Prothrombin
Ligand
BDBM50098598
Substrate
Meas. Tech.
ChEMBL_1504785 (CHEMBL3595070)
Ki
4000±n/a nM
Citation
 Priestley, ESCheney, DLDeLucca, IWei, ALuettgen, JMRendina, ARWong, PCWexler, RR Structure-Based Design of Macrocyclic Coagulation Factor VIIa Inhibitors. J Med Chem 58:6225-36 (2015)  
Target
Name:
Prothrombin
Synonyms:
Activation peptide fragment 1 Coagulation factor II Prothrombin precursor Thrombin heavy chain | Thrombin light chain
Type:
Protein
Mol. Mass.:
70029.57
Organism:
Homo sapiens (Human)
Description:
P00734
Residue:
622
  
Inhibitor
Name:
BDBM50098598
Synonyms:
CHEMBL3594311
Type:
Small organic molecule
Emp. Form.:
C31H33N5O4S
Mol. Mass.:
571.69
SMILES:
CC(C)S(=O)(=O)c1ccc2NC(=O)CCCc3ccc(cc3)[C@@H](Nc3ccc4c(N)nccc4c3)C(=O)NCc1c2
: