Target
Coagulation factor X
Ligand
BDBM50098598
Substrate
Meas. Tech.
ChEMBL_1504784 (CHEMBL3595069)
Ki
3300±n/a nM
Citation
 Priestley, ESCheney, DLDeLucca, IWei, ALuettgen, JMRendina, ARWong, PCWexler, RR Structure-Based Design of Macrocyclic Coagulation Factor VIIa Inhibitors. J Med Chem 58:6225-36 (2015)  
Target
Name:
Coagulation factor X
Synonyms:
Activated coagulation factor X (FXa) Coagulation factor X precursor F10 Factor X heavy chain Factor Xa Stuart-Prower factor
Type:
Enzyme
Mol. Mass.:
54726.60
Organism:
Homo sapiens (Human)
Description:
Residue:
488
  
Inhibitor
Name:
BDBM50098598
Synonyms:
CHEMBL3594311
Type:
Small organic molecule
Emp. Form.:
C31H33N5O4S
Mol. Mass.:
571.69
SMILES:
CC(C)S(=O)(=O)c1ccc2NC(=O)CCCc3ccc(cc3)[C@@H](Nc3ccc4c(N)nccc4c3)C(=O)NCc1c2
: