Target
Coagulation factor X
Ligand
BDBM50098591
Substrate
Meas. Tech.
ChEMBL_1504784 (CHEMBL3595069)
Ki
>9000±n/a nM
Citation
 Priestley, ESCheney, DLDeLucca, IWei, ALuettgen, JMRendina, ARWong, PCWexler, RR Structure-Based Design of Macrocyclic Coagulation Factor VIIa Inhibitors. J Med Chem 58:6225-36 (2015)  
Target
Name:
Coagulation factor X
Synonyms:
Activated coagulation factor X (FXa) Coagulation factor X precursor F10 Factor X heavy chain Factor Xa Stuart-Prower factor
Type:
Enzyme
Mol. Mass.:
54726.60
Organism:
Homo sapiens (Human)
Description:
Residue:
488
  
Inhibitor
Name:
BDBM50098591
Synonyms:
CHEMBL3594305
Type:
Small organic molecule
Emp. Form.:
C28H27N5O2
Mol. Mass.:
465.5463
SMILES:
Nc1nccc2cc(N[C@@H]3c4ccc(CCCC(=O)Nc5cccc(CNC3=O)c5)cc4)ccc12
: