Target
Rap guanine nucleotide exchange factor 3
Ligand
BDBM50098787
Substrate
Meas. Tech.
ChEMBL_1504800 (CHEMBL3595153)
IC50
2600±n/a nM
Citation
 Ye, NZhu, YChen, HLiu, ZMei, FCWild, CChen, HCheng, XZhou, J Structure-Activity Relationship Studies of Substituted 2-(Isoxazol-3-yl)-2-oxo-N'-phenyl-acetohydrazonoyl Cyanide Analogues: Identification of Potent Exchange Proteins Directly Activated by cAMP (EPAC) Antagonists. J Med Chem 58:6033-47 (2015)  
Target
Name:
Rap guanine nucleotide exchange factor 3
Synonyms:
CGEF1 EPAC 1 Exchange factor directly activated by cAMP 1 RAPGEF3 Rap1 guanine-nucleotide-exchange factor directly activated by cAMP cAMP-regulated guanine nucleotide exchange factor I
Type:
PROTEIN
Mol. Mass.:
103769.52
Organism:
Homo sapiens (Human)
Description:
ChEMBL_104531
Residue:
923
  
Inhibitor
Name:
BDBM50098787
Synonyms:
CHEMBL3593468
Type:
Small organic molecule
Emp. Form.:
C18H16Cl2N4O2
Mol. Mass.:
391.251
SMILES:
Clc1cc(Cl)cc(N\N=C(/C#N)C(=O)c2cc(on2)C2CCCCC2)c1
: