Target
Proteasome subunit beta type-8
Ligand
BDBM50099836
Substrate
Meas. Tech.
ChEMBL_1446797 (CHEMBL3371271)
IC50
53±n/a nM
Citation
 de Bruin, GHuber, EMXin, BTvan Rooden, EJAl-Ayed, KKim, KBKisselev, AFDriessen, Cvan der Stelt, Mvan der Marel, GAGroll, MOverkleeft, HS Structure-based design of฿1i or฿5i specific inhibitors of human immunoproteasomes. J Med Chem 57:6197-209 (2014)  
Target
Name:
Proteasome subunit beta type-8
Synonyms:
26S proteosome Low molecular mass protein 7 Multicatalytic endopeptidase complex subunit C13 PSMB5i Proteasome component C13 Proteasome subunit beta-5i Y2
Type:
PROTEIN
Mol. Mass.:
30357.49
Organism:
Homo sapiens (Human)
Description:
ChEMBL_1446797
Residue:
276
  
Inhibitor
Name:
BDBM50099836
Synonyms:
CHEMBL3319591
Type:
Small organic molecule
Emp. Form.:
C36H38N4O5S
Mol. Mass.:
638.776
SMILES:
C[C@@H](NC(=O)C1=C(C)c2ccccc2C1)C(=O)N[C@@H](Cc1c[nH]c2ccccc12)C(=O)N[C@@H](Cc1ccccc1)\C=C\S(C)(=O)=O
: