Target
Bifunctional epoxide hydrolase 2
Ligand
BDBM50100534
Substrate
Meas. Tech.
ChEMBL_1455803 (CHEMBL3361515)
Ki
0.360000±n/a nM
Citation
 Lee, KSLiu, JYWagner, KMPakhomova, SDong, HMorisseau, CFu, SHYang, JWang, PUlu, AMate, CANguyen, LVHwang, SHEdin, MLMara, AAWulff, HNewcomer, MEZeldin, DCHammock, BD Optimized inhibitors of soluble epoxide hydrolase improve in vitro target residence time and in vivo efficacy. J Med Chem 57:7016-30 (2014)  
Target
Name:
Bifunctional epoxide hydrolase 2
Synonyms:
Cytosolic epoxide hydrolase 2 EPHX2 HYES_HUMAN Soluble epoxide hydrolase (sEH) | epoxide hydrolase 2, cytoplasmic
Type:
Enzyme
Mol. Mass.:
62613.07
Organism:
Homo sapiens (Human)
Description:
P34913
Residue:
555
  
Inhibitor
Name:
BDBM50100534
Synonyms:
CHEMBL3327074
Type:
Small organic molecule
Emp. Form.:
C18H24F3N3O3
Mol. Mass.:
387.3967
SMILES:
CCC(C)C(=O)N1CCC(CC1)NC(=O)Nc1ccc(OC(F)(F)F)cc1
: