Target
Mu-type opioid receptor
Ligand
BDBM50012477
Substrate
Meas. Tech.
ChEMBL_1456841 (CHEMBL3367574)
Ki
0.024000±n/a nM
Citation
 Weltrowska, GLemieux, CChung, NNGuo, JJWilkes, BCSchiller, PW 'Carba'-carfentanil (trans isomer): aµ opioid receptor (MOR) partial agonist with a distinct binding mode. Bioorg Med Chem 22:4581-6 (2014)  
Target
Name:
Mu-type opioid receptor
Synonyms:
MOR-1 Mu-type opioid receptor (MOR) OPRM_RAT Opioid receptor B Ror-b
Type:
G Protein-Coupled Receptor (GPCR)
Mol. Mass.:
44503.11
Organism:
Rattus norvegicus (rat)
Description:
Competition binding assays were carried out using membrane preparations from transfected HN9.10 cells that constitutively expressed the mu opioid receptor.
Residue:
398
  
Inhibitor
Name:
BDBM50012477
Synonyms:
1-Phenethyl-4-(phenyl-propionyl-amino)-piperidine-4-carboxylic acid methyl ester CARFENTANIL Carfentanil1-Phenethyl-4-(phenyl-propionyl-amino)-piperidine-4-carboxylic acid methyl ester | US20230399418, Compound Carfentanil
Type:
Small organic molecule
Emp. Form.:
C24H30N2O3
Mol. Mass.:
394.5066
SMILES:
CCC(=O)N(c1ccccc1)C1(CCN(CCc2ccccc2)CC1)C(=O)OC
: