Target
Delta-type opioid receptor
Ligand
BDBM50012477
Substrate
Meas. Tech.
ChEMBL_1456842 (CHEMBL3367575)
Ki
3.3±n/a nM
Citation
 Weltrowska, GLemieux, CChung, NNGuo, JJWilkes, BCSchiller, PW 'Carba'-carfentanil (trans isomer): aµ opioid receptor (MOR) partial agonist with a distinct binding mode. Bioorg Med Chem 22:4581-6 (2014)  
Target
Name:
Delta-type opioid receptor
Synonyms:
Cytochrome P450 3A4 Delta opioid receptor Delta-type opioid receptor (DOR) OPRD_RAT Opioid receptor Opioid receptors; mu & delta Ror-a | Voltage-gated potassium channel
Type:
G Protein-Coupled Receptor (GPCR)
Mol. Mass.:
40465.04
Organism:
Rattus norvegicus (rat)
Description:
Competition binding assays were using CHO-K1 cell membranes expressing the opioid receptor.
Residue:
372
  
Inhibitor
Name:
BDBM50012477
Synonyms:
1-Phenethyl-4-(phenyl-propionyl-amino)-piperidine-4-carboxylic acid methyl ester CARFENTANIL Carfentanil1-Phenethyl-4-(phenyl-propionyl-amino)-piperidine-4-carboxylic acid methyl ester | US20230399418, Compound Carfentanil
Type:
Small organic molecule
Emp. Form.:
C24H30N2O3
Mol. Mass.:
394.5066
SMILES:
CCC(=O)N(c1ccccc1)C1(CCN(CCc2ccccc2)CC1)C(=O)OC
: