Target
Kappa-type opioid receptor
Ligand
BDBM50101310
Substrate
Meas. Tech.
ChEMBL_1454174 (CHEMBL3363204)
Ki
>1000±n/a nM
Citation
 Hirayama, SWada, NNemoto, TIwai, TFujii, HNagase, H Synthesis and Pharmacology of a Novel¿ Opioid Receptor (KOR) Agonist with a 1,3,5-Trioxazatriquinane Skeleton. ACS Med Chem Lett 5:868-72 (2014)  
Target
Name:
Kappa-type opioid receptor
Synonyms:
Kappa Opioid Receptor OPRK1 Opiate Kappa 1 | mu/kappa opioid receptor
Type:
G Protein-Coupled Receptor (GPCR)
Mol. Mass.:
42744.99
Organism:
Cavia porcellus (domestic guinea pig)
Description:
P41144
Residue:
380
  
Inhibitor
Name:
BDBM50101310
Synonyms:
CHEMBL3326359
Type:
Small organic molecule
Emp. Form.:
C22H25NO5
Mol. Mass.:
383.4376
SMILES:
[H][C@]12CO[C@]3([H])N1[C@@]([H])(O[C@]3(C)c1cccc(OC)c1)[C@@](C)(O2)c1cccc(OC)c1
: