Target
Delta-type opioid receptor
Ligand
BDBM50101309
Substrate
Meas. Tech.
ChEMBL_1454173 (CHEMBL3363203)
Ki
>1000±n/a nM
Citation
 Hirayama, SWada, NNemoto, TIwai, TFujii, HNagase, H Synthesis and Pharmacology of a Novel¿ Opioid Receptor (KOR) Agonist with a 1,3,5-Trioxazatriquinane Skeleton. ACS Med Chem Lett 5:868-72 (2014)  
Target
Name:
Delta-type opioid receptor
Synonyms:
DOR-1 MSL-2 OPRD_MOUSE Oprd1
Type:
Enzyme Catalytic Domain
Mol. Mass.:
40577.25
Organism:
MOUSE
Description:
P32300
Residue:
372
  
Inhibitor
Name:
BDBM50101309
Synonyms:
CHEMBL3326360
Type:
Small organic molecule
Emp. Form.:
C21H23NO5
Mol. Mass.:
369.411
SMILES:
[H][C@]12CO[C@]3([H])N1[C@@]([H])(O[C@]3(C)c1cccc(OC)c1)[C@@](C)(O2)c1cccc(O)c1
: