Target
Delta-type opioid receptor
Ligand
BDBM50101325
Substrate
Meas. Tech.
ChEMBL_1454173 (CHEMBL3363203)
Ki
>1000±n/a nM
Citation
 Hirayama, SWada, NNemoto, TIwai, TFujii, HNagase, H Synthesis and Pharmacology of a Novel¿ Opioid Receptor (KOR) Agonist with a 1,3,5-Trioxazatriquinane Skeleton. ACS Med Chem Lett 5:868-72 (2014)  
Target
Name:
Delta-type opioid receptor
Synonyms:
DOR-1 MSL-2 OPRD_MOUSE Oprd1
Type:
Enzyme Catalytic Domain
Mol. Mass.:
40577.25
Organism:
MOUSE
Description:
P32300
Residue:
372
  
Inhibitor
Name:
BDBM50101325
Synonyms:
CHEMBL3326351
Type:
Small organic molecule
Emp. Form.:
C27H27NO6
Mol. Mass.:
461.5064
SMILES:
[H][C@]12O[C@](C)(c3cccc(O)c3)[C@]3([H])O[C@@](C)(c4cccc(O)c4)[C@]([H])(O[C@]1(C)c1cccc(O)c1)N23
: