Target
Sodium- and chloride-dependent GABA transporter 3
Ligand
BDBM50000102
Substrate
Meas. Tech.
ChEMBL_1454198 (CHEMBL3363498)
IC50
41200±n/a nM
Citation
 Kobayashi, TSuemasa, AIgawa, AIde, SFukuda, HAbe, HArisawa, MMinami, MShuto, S Conformationally Restricted GABA with Bicyclo[3.1.0]hexane Backbone as the First Highly Selective BGT-1 Inhibitor. ACS Med Chem Lett 5:889-93 (2014)  
Target
Name:
Sodium- and chloride-dependent GABA transporter 3
Synonyms:
GABA transporter 3 GAT-3 S6A11_HUMAN Solute carrier family 6 member 11
Type:
PROTEIN
Mol. Mass.:
70607.60
Organism:
Homo sapiens (Human)
Description:
ChEMBL_1454198
Residue:
632
  
Inhibitor
Name:
BDBM50000102
Synonyms:
3-aminopropanoic acidbeta-alanine CHEMBL297569 beta-aminopropionic acid | omega-aminopropionic acid
Type:
Small organic molecule
Emp. Form.:
C3H7NO2
Mol. Mass.:
89.0932
SMILES:
NCCC(O)=O
: