Target
Sodium- and chloride-dependent GABA transporter 1
Ligand
BDBM50419338
Substrate
Meas. Tech.
ChEMBL_1454196 (CHEMBL3363226)
IC50
11400±n/a nM
Citation
 Kobayashi, TSuemasa, AIgawa, AIde, SFukuda, HAbe, HArisawa, MMinami, MShuto, S Conformationally Restricted GABA with Bicyclo[3.1.0]hexane Backbone as the First Highly Selective BGT-1 Inhibitor. ACS Med Chem Lett 5:889-93 (2014)  
Target
Name:
Sodium- and chloride-dependent GABA transporter 1
Synonyms:
GABA transporter 1 GABT1 GAT1 SLC6A1 Solute carrier family 6 member 1
Type:
PROTEIN
Mol. Mass.:
67079.40
Organism:
Homo sapiens (Human)
Description:
ChEMBL_1454196
Residue:
599
  
Inhibitor
Name:
BDBM50419338
Synonyms:
CHEMBL1446457
Type:
Small organic molecule
Emp. Form.:
C27H30N2O2
Mol. Mass.:
414.5393
SMILES:
COc1ccccc1C1(O)CCN(CCCn2c3ccccc3c3ccccc23)CC1
: