Target
Histone chaperone ASF1A
Ligand
BDBM50101681
Substrate
Meas. Tech.
ChEMBL_1462421 (CHEMBL3395843)
IC50
>100000±n/a nM
Citation
 Miknis, GFStevens, SJSmith, LEOstrov, DAChurchill, ME Development of novel Asf1-H3/H4 inhibitors. Bioorg Med Chem Lett 25:963-8 (2015)  
Target
Name:
Histone chaperone ASF1A
Synonyms:
ASF1A Anti-silencing function protein 1 homolog A CIA Histone chaperone ASF1A hAsf1a | hCIA
Type:
PROTEIN
Mol. Mass.:
22950.75
Organism:
Homo sapiens (Human)
Description:
ChEMBL_109562
Residue:
204
  
Inhibitor
Name:
BDBM50101681
Synonyms:
CHEMBL3394917
Type:
Small organic molecule
Emp. Form.:
C20H16N4O2
Mol. Mass.:
344.3666
SMILES:
O=C(N\N=C\c1ccncc1)c1ccc(NC(=O)c2ccccc2)cc1
: