Target
Mu-type opioid receptor
Ligand
BDBM50102826
Substrate
Meas. Tech.
ChEMBL_1432427 (CHEMBL3385150)
Ki
0.052000±n/a nM
Citation
 Watanabe, YKitazawa, SFujii, HNemoto, THirayama, SIwai, TGouda, HHirono, SNagasea, H Design, synthesis, and structure-activity relationship of novel opioid¿ receptor selective agonists:a-iminoamide derivatives with an azabicyclo[2.2.2]octene skeleton. Bioorg Med Chem Lett 24:4980-3 (2014)  
Target
Name:
Mu-type opioid receptor
Synonyms:
M-OR-1 Mor OPRM_MOUSE Oprm | Oprm1
Type:
Enzyme Catalytic Domain
Mol. Mass.:
44431.62
Organism:
MOUSE
Description:
OPIATE Mu OPRM1 MOUSE::P42866
Residue:
398
  
Inhibitor
Name:
BDBM50102826
Synonyms:
CHEMBL3339374
Type:
Small organic molecule
Emp. Form.:
C30H35N3O4
Mol. Mass.:
501.6166
SMILES:
Oc1ccc2CC3N(CC4CC4)CCC45C(Oc1c24)[C@@]1(O)CC[C@@]35N[C@@H]1CC(=O)NCc1ccccc1
: