Target
Cytochrome P450 1A2
Ligand
BDBM50101815
Substrate
Meas. Tech.
ChEMBL_1493769 (CHEMBL3530852)
IC50
>30000±n/a nM
Citation
 Lee, CAJones, JPKatayama, JKaspera, RJiang, YFreiwald, SSmith, EWalker, GSTotah, RA Identifying a selective substrate and inhibitor pair for the evaluation of CYP2J2 activity. Drug Metab Dispos 40:943-51 (2012)  
Target
Name:
Cytochrome P450 1A2
Synonyms:
CP1A2_HUMAN CYPIA2 Cytochrome P(3)450 Cytochrome P450 1A2 (CYP1A2) Cytochrome P450-P3
Type:
Enzyme
Mol. Mass.:
58423.38
Organism:
Homo sapiens (Human)
Description:
P05177
Residue:
516
  
Inhibitor
Name:
BDBM50101815
Synonyms:
CHEBI:7550 | Nicardipine
Type:
Small organic molecule
Emp. Form.:
C26H29N3O6
Mol. Mass.:
479.525
SMILES:
COC(=O)C1=C(C)NC(C)=C(C1c1cccc(c1)[N+]([O-])=O)C(=O)OCCN(C)Cc1ccccc1
: