Target
Cytochrome P450 2J2
Ligand
BDBM41132
Substrate
Meas. Tech.
ChEMBL_1485701 (CHEMBL3541093)
IC50
9470±n/a nM
Citation
 Ren, SZeng, JMei, YZhang, JZYan, SFFei, JChen, L Discovery and characterization of novel, potent, and selective cytochrome P450 2J2 inhibitors. Drug Metab Dispos 41:60-71 (2012)  
Target
Name:
Cytochrome P450 2J2
Synonyms:
CP2J2_HUMAN | CYP2J2
Type:
Enzyme
Mol. Mass.:
57623.04
Organism:
Homo sapiens (Human)
Description:
P51589
Residue:
502
  
Inhibitor
Name:
BDBM41132
Synonyms:
MLS000028542 TRIAMCINOLONE | cid_31307
Type:
Small organic molecule
Emp. Form.:
C21H27FO6
Mol. Mass.:
394.4339
SMILES:
C[C@]12C[C@H](O)[C@@]3(F)[C@@H](CCC4=CC(=O)C=C[C@]34C)[C@@H]1C[C@@H](O)[C@]2(O)C(=O)CO
: