Target
Cytochrome P450 2C19
Ligand
BDBM41132
Substrate
Meas. Tech.
ChEMBL_1485705 (CHEMBL3541097)
IC50
>50000±n/a nM
Citation
 Ren, SZeng, JMei, YZhang, JZYan, SFFei, JChen, L Discovery and characterization of novel, potent, and selective cytochrome P450 2J2 inhibitors. Drug Metab Dispos 41:60-71 (2012)  
Target
Name:
Cytochrome P450 2C19
Synonyms:
CP2CJ_HUMAN CYPIIC17 Cytochrome P450 2C19 (CYP2C19) Mephenytoin 4-hydroxylase P450-254C
Type:
Enzyme
Mol. Mass.:
55935.47
Organism:
Homo sapiens (Human)
Description:
P33261
Residue:
490
  
Inhibitor
Name:
BDBM41132
Synonyms:
MLS000028542 TRIAMCINOLONE | cid_31307
Type:
Small organic molecule
Emp. Form.:
C21H27FO6
Mol. Mass.:
394.4339
SMILES:
C[C@]12C[C@H](O)[C@@]3(F)[C@@H](CCC4=CC(=O)C=C[C@]34C)[C@@H]1C[C@@H](O)[C@]2(O)C(=O)CO
: