Target
L-lactate dehydrogenase A chain
Ligand
BDBM50433843
Substrate
Meas. Tech.
ChEMBL_1435605 (CHEMBL3386528)
IC50
480±n/a nM
Citation
 Granchi, CFancelli, DMinutolo, F An update on therapeutic opportunities offered by cancer glycolytic metabolism. Bioorg Med Chem Lett 24:4915-25 (2014)  
Target
Name:
L-lactate dehydrogenase A chain
Synonyms:
Cell proliferation-inducing gene 19 protein L-lactate dehydrogenase A Chain LDH-A LDHA Lactate dehydrogenase A (LDHA) | Renal carcinoma antigen NY-REN-59
Type:
Protein
Mol. Mass.:
36694.85
Organism:
Homo sapiens (Human)
Description:
P00338::PDB Code: 4ajp
Residue:
332
  
Inhibitor
Name:
BDBM50433843
Synonyms:
CHEMBL2382401
Type:
Small organic molecule
Emp. Form.:
C20H16ClN5O4S2
Mol. Mass.:
489.955
SMILES:
CC(Sc1nc(-c2ccc(Cl)cc2)c(C#N)c(=O)[nH]1)C(=O)Nc1ccc(cc1)S(N)(=O)=O
: