Target
Histone deacetylase 4
Ligand
BDBM29589
Substrate
Meas. Tech.
ChEMBL_1484271 (CHEMBL3538487)
IC50
200±n/a nM
Citation
 Fredenhagen, AKittelmann, MOberer, LKuhn, AKühnöl, JDélémonté, TAichholz, RWang, PAtadja, PShultz, MD Biocatalytic synthesis and structure elucidation of cyclized metabolites of the deacetylase inhibitor panobinostat (LBH589). Drug Metab Dispos 40:1041-50 (2012)  
Target
Name:
Histone deacetylase 4
Synonyms:
Cereblon/Histone deacetylase 4 HDAC4 Histone acetylase 4(HDAC4) KIAA0288
Type:
Enzyme
Mol. Mass.:
119049.39
Organism:
Homo sapiens (Human)
Description:
P56524
Residue:
1084
  
Inhibitor
Name:
BDBM29589
Synonyms:
Faridak LBH-589B US10722597, Compound Panobinostat
Type:
Small organic molecule
Emp. Form.:
C21H23N3O2
Mol. Mass.:
349.4262
SMILES:
Cc1[nH]c2ccccc2c1CCNCc1ccc(\C=C\C(=O)NO)cc1
: