Target
D(3) dopamine receptor
Ligand
BDBM50104923
Substrate
Meas. Tech.
ChEMBL_1506475 (CHEMBL3599874)
Ki
0.118000±n/a nM
Citation
 Boateng, CABakare, OMZhan, JBanala, AKBurzynski, CPommier, EKeck, TMDonthamsetti, PJavitch, JARais, RSlusher, BSXi, ZXNewman, AH High Affinity Dopamine D3 Receptor (D3R)-Selective Antagonists Attenuate Heroin Self-Administration in Wild-Type but not D3R Knockout Mice. J Med Chem 58:6195-213 (2015)  
Target
Name:
D(3) dopamine receptor
Synonyms:
DOPAMINE D3 DRD3_HUMAN Dopamine D3 receptor (D3) Dopamine receptor Dopamine receptor D3
Type:
Mol. Mass.:
44243.43
Organism:
Homo sapiens (Human)
Description:
Residue:
400
  
Inhibitor
Name:
BDBM50104923
Synonyms:
CHEMBL3597643
Type:
Small organic molecule
Emp. Form.:
C27H30N4O
Mol. Mass.:
426.5533
SMILES:
O=C(NCCCCN1CCN(CC1)c1cccc2ccccc12)c1cc2ccccc2[nH]1
: