Target
Bacterial leucyl aminopeptidase
Ligand
BDBM50105577
Substrate
Meas. Tech.
ChEMBL_1507540 (CHEMBL3599796)
Ki
30000±n/a nM
Citation
 Revelant, GAl-Lakkis-Wehbe, MSchmitt, MAlavi, SSchmitt, CRoux, LAl-Masri, MSchifano-Faux, NMaiereanu, CTarnus, CAlbrecht, S Exploring S1 plasticity and probing S1' subsite of mammalian aminopeptidase N/CD13 with highly potent and selective aminobenzosuberone inhibitors. Bioorg Med Chem 23:3192-207 (2015)  
Target
Name:
Bacterial leucyl aminopeptidase
Synonyms:
AMPX_VIBPR | Bacterial leucyl aminopeptidase precursor
Type:
PROTEIN
Mol. Mass.:
54213.72
Organism:
Vibrio proteolyticus
Description:
ChEMBL_1507540
Residue:
504
  
Inhibitor
Name:
BDBM50105577
Synonyms:
CHEMBL3597446
Type:
Small organic molecule
Emp. Form.:
C17H17ClN2O3
Mol. Mass.:
332.781
SMILES:
Cl.NC1CCc2cccc(-c3cccc(c3)[N+]([O-])=O)c2CC1=O
: