Target
Metabotropic glutamate receptor 5
Ligand
BDBM50105831
Substrate
Meas. Tech.
ChEMBL_1507572 (CHEMBL3599914)
Ki
0.500000±n/a nM
Citation
 Anighoro, AGraziani, DBettinelli, ICilia, ADe Toma, CLonghi, MMangiarotti, FMenegon, SPirona, LPoggesi, ERiva, CRastelli, G Insights into the interaction of negative allosteric modulators with the metabotropic glutamate receptor 5: discovery and computational modeling of a new series of ligands with nanomolar affinity. Bioorg Med Chem 23:3040-58 (2015)  
Target
Name:
Metabotropic glutamate receptor 5
Synonyms:
GPRC1E GRM5_HUMAN metabotropic glutamate 5 | metabotropic glutamate 5a
Type:
Enzyme
Mol. Mass.:
132484.72
Organism:
Homo sapiens (Human)
Description:
Residue:
1212
  
Inhibitor
Name:
BDBM50105831
Synonyms:
CHEMBL3597584
Type:
Small organic molecule
Emp. Form.:
C18H16N4O3
Mol. Mass.:
336.3446
SMILES:
[O-][N+](=O)c1cccnc1N1CCN(CC1)C(=O)C#Cc1ccccc1
: