Target
Metabotropic glutamate receptor 5
Ligand
BDBM50105803
Substrate
Meas. Tech.
ChEMBL_1507571 (CHEMBL3599913)
Ki
0.400000±n/a nM
Citation
 Anighoro, AGraziani, DBettinelli, ICilia, ADe Toma, CLonghi, MMangiarotti, FMenegon, SPirona, LPoggesi, ERiva, CRastelli, G Insights into the interaction of negative allosteric modulators with the metabotropic glutamate receptor 5: discovery and computational modeling of a new series of ligands with nanomolar affinity. Bioorg Med Chem 23:3040-58 (2015)  
Target
Name:
Metabotropic glutamate receptor 5
Synonyms:
GRM5_RAT Grm5 Mglur5 metabotropic glutamate 5/1-C metabotropic glutamate 5a
Type:
Enzyme
Mol. Mass.:
131900.14
Organism:
Rattus norvegicus (Rat)
Description:
P31424
Residue:
1203
  
Inhibitor
Name:
BDBM50105803
Synonyms:
CHEMBL3597598
Type:
Small organic molecule
Emp. Form.:
C19H16ClN3O2
Mol. Mass.:
353.802
SMILES:
[#8-]-[#7+](=O)-c1cccnc1-[#7]-1-[#6]-[#6]\[#6](-[#6]-[#6]-1)=[#6]/C#Cc1cccc(Cl)c1
: