Target
Dual specificity tyrosine-phosphorylation-regulated kinase 1B
Ligand
BDBM50105913
Substrate
Meas. Tech.
ChEMBL_1508048 (CHEMBL3599538)
IC50
70±n/a nM
Citation
 Yadav, RRSharma, SJoshi, PWani, AVishwakarma, RAKumar, ABharate, SB Meridianin derivatives as potent Dyrk1A inhibitors and neuroprotective agents. Bioorg Med Chem Lett 25:2948-52 (2015)  
Target
Name:
Dual specificity tyrosine-phosphorylation-regulated kinase 1B
Synonyms:
DYR1B_HUMAN Dual specificity tyrosine-phosphorylation-regulated kinase 1B MIRK
Type:
Enzyme
Mol. Mass.:
69222.24
Organism:
Homo sapiens (Human)
Description:
Q9Y463
Residue:
629
  
Inhibitor
Name:
BDBM50105913
Synonyms:
CHEMBL3597991
Type:
Small organic molecule
Emp. Form.:
C12H8N2S2
Mol. Mass.:
244.335
SMILES:
c1ncc(s1)-c1cc(cs1)-c1cccnc1
: