Target
Substance-P receptor
Ligand
BDBM50106365
Substrate
Meas. Tech.
ChEMBL_1506667 (CHEMBL3598619)
IC50
0.200000±n/a nM
Citation
 Degnan, APTora, GOHan, YRajamani, RBertekap, RKrause, RDavis, CDHu, JMorgan, DTaylor, SJKrause, KLi, YWMattson, GCunningham, MATaber, MTLodge, NJBronson, JJGillman, KWMacor, JE Biaryls as potent, tunable dual neurokinin 1 receptor antagonists and serotonin transporter inhibitors. Bioorg Med Chem Lett 25:3039-43 (2015)  
Target
Name:
Substance-P receptor
Synonyms:
NK-1 receptor NK1 Receptor NK1R_HUMAN Neurokinin-1 (NK-1) SPR TACR1 Tachykinin receptor 1 (NK1) | tachykinin
Type:
G Protein-Coupled Receptor (GPCR)
Mol. Mass.:
46254.43
Organism:
Homo sapiens (Human)
Description:
P25103
Residue:
407
  
Inhibitor
Name:
BDBM50106365
Synonyms:
CHEMBL3596492
Type:
Small organic molecule
Emp. Form.:
C28H27F3N2O
Mol. Mass.:
464.522
SMILES:
CN1CCC(COCc2cc(cc(c2)C(F)(F)F)-c2ccc(cc2)C#N)(CC1)c1ccccc1
: