Target
Carbonic anhydrase 2
Ligand
BDBM26994
Substrate
Meas. Tech.
ChEMBL_1507028 (CHEMBL3599982)
Ki
390000±n/a nM
Citation
 Pinard, MALotlikar, SRBoone, CDVullo, DSupuran, CTPatrauchan, MAMcKenna, R Structure and inhibition studies of a type II beta-carbonic anhydrase psCA3 from Pseudomonas aeruginosa. Bioorg Med Chem 23:4831-8 (2015)  
Target
Name:
Carbonic anhydrase 2
Synonyms:
CA-II CAC Carbonate dehydratase II Carbonic anhydrase 2 (CA-II) Carbonic anhydrase C Carbonic anhydrase II (CA-II) Carbonic anhydrase II (hCA II) | Carbonic anhydrase isoenzyme II (hCA II)
Type:
Enzyme
Mol. Mass.:
29250.71
Organism:
Homo sapiens (Human)
Description:
P00918
Residue:
260
  
Inhibitor
Name:
BDBM26994
Synonyms:
CHEMBL68253 sulfamic acid
Type:
Emp. Form.:
H3NO3S
Mol. Mass.:
97.094
SMILES:
NS(O)(=O)=O
: