Target
Carbonic anhydrase 2
Ligand
BDBM50333132
Substrate
Meas. Tech.
ChEMBL_1507028 (CHEMBL3599982)
Ki
760000±n/a nM
Citation
 Pinard, MALotlikar, SRBoone, CDVullo, DSupuran, CTPatrauchan, MAMcKenna, R Structure and inhibition studies of a type II beta-carbonic anhydrase psCA3 from Pseudomonas aeruginosa. Bioorg Med Chem 23:4831-8 (2015)  
Target
Name:
Carbonic anhydrase 2
Synonyms:
CA-II CAC Carbonate dehydratase II Carbonic anhydrase 2 (CA-II) Carbonic anhydrase C Carbonic anhydrase II (CA-II) Carbonic anhydrase II (hCA II) | Carbonic anhydrase isoenzyme II (hCA II)
Type:
Enzyme
Mol. Mass.:
29250.71
Organism:
Homo sapiens (Human)
Description:
P00918
Residue:
260
  
Inhibitor
Name:
BDBM50333132
Synonyms:
CHEMBL1644701 | sodium iminodisulfate
Type:
Small organic molecule
Emp. Form.:
HNO8S2
Mol. Mass.:
207.141
SMILES:
[O-]S(=O)(=O)ONOS([O-])(=O)=O
: