Target
Carbonic anhydrase 2
Ligand
BDBM50106422
Substrate
Meas. Tech.
ChEMBL_1508537 (CHEMBL3602573)
Ki
0.070000±n/a nM
Citation
 Meleddu, RMaccioni, EDistinto, SBianco, GMelis, CAlcaro, SCottiglia, FCeruso, MSupuran, CT New 4-[(3-cyclohexyl-4-aryl-2,3-dihydro-1,3-thiazol-2-ylidene)amino]benzene-1-sulfonamides, synthesis and inhibitory activity toward carbonic anhydrase I, II, IX, XII. Bioorg Med Chem Lett 25:3281-4 (2015)  
Target
Name:
Carbonic anhydrase 2
Synonyms:
CA-II CAC Carbonate dehydratase II Carbonic anhydrase 2 (CA-II) Carbonic anhydrase C Carbonic anhydrase II (CA-II) Carbonic anhydrase II (hCA II) | Carbonic anhydrase isoenzyme II (hCA II)
Type:
Enzyme
Mol. Mass.:
29250.71
Organism:
Homo sapiens (Human)
Description:
P00918
Residue:
260
  
Inhibitor
Name:
BDBM50106422
Synonyms:
CHEMBL3601892
Type:
Small organic molecule
Emp. Form.:
C19H21N3O2S3
Mol. Mass.:
419.584
SMILES:
NS(=O)(=O)c1ccc(cc1)\N=c1/scc(-c2cccs2)n1C1CCCCC1
: