Target
Carbonic anhydrase 1
Ligand
BDBM50107369
Substrate
Meas. Tech.
ChEMBL_1509203 (CHEMBL3602836)
Ki
245±n/a nM
Citation
 Khloya, PCeruso, MRam, SSupuran, CTSharma, PK Sulfonamide bearing pyrazolylpyrazolines as potent inhibitors of carbonic anhydrase isoforms I, II, IX and XII. Bioorg Med Chem Lett 25:3208-12 (2015)  
Target
Name:
Carbonic anhydrase 1
Synonyms:
CA-I CAB Carbonate dehydratase I Carbonic anhydrase 1 (CA I) Carbonic anhydrase 1 (Recombinant CA I) Carbonic anhydrase B Carbonic anhydrase I (CA I) Carbonic anhydrase I (CAI) Carbonic anhydrase isoenzyme I (hCA I) | hCA
Type:
Enzyme
Mol. Mass.:
28873.37
Organism:
Homo sapiens (Human)
Description:
P00915
Residue:
261
  
Inhibitor
Name:
BDBM50107369
Synonyms:
CHEMBL3601390
Type:
Small organic molecule
Emp. Form.:
C25H23ClN6O4S2
Mol. Mass.:
571.071
SMILES:
Cc1nn(c(Cl)c1C1CC(=NN1c1ccc(cc1)S(N)(=O)=O)c1ccccc1)-c1ccc(cc1)S(N)(=O)=O
: