Target
Carbonic anhydrase 12
Ligand
BDBM50107373
Substrate
Meas. Tech.
ChEMBL_1509206 (CHEMBL3602839)
Ki
0.540000±n/a nM
Citation
 Khloya, PCeruso, MRam, SSupuran, CTSharma, PK Sulfonamide bearing pyrazolylpyrazolines as potent inhibitors of carbonic anhydrase isoforms I, II, IX and XII. Bioorg Med Chem Lett 25:3208-12 (2015)  
Target
Name:
Carbonic anhydrase 12
Synonyms:
CA-XII CAH12_HUMAN Carbonic anhydrase Carbonic anhydrase XII Carbonic anhydrase XII (CAXII) | Tumor antigen HOM-RCC-3.1.3
Type:
Enzyme
Mol. Mass.:
39456.00
Organism:
Homo sapiens (Human)
Description:
Catalytic domain of human cloned isozyme was used in the assay
Residue:
354
  
Inhibitor
Name:
BDBM50107373
Synonyms:
CHEMBL3601461
Type:
Small organic molecule
Emp. Form.:
C22H22ClN5O4S
Mol. Mass.:
487.959
SMILES:
COc1ccc(cc1)C1=NN(C(C1)c1c(C)nn(c1Cl)-c1ccc(cc1)S(N)(=O)=O)C(C)=O
: