Target
Carbonic anhydrase 9
Ligand
BDBM50107370
Substrate
Meas. Tech.
ChEMBL_1509205 (CHEMBL3602838)
Ki
67±n/a nM
Citation
 Khloya, PCeruso, MRam, SSupuran, CTSharma, PK Sulfonamide bearing pyrazolylpyrazolines as potent inhibitors of carbonic anhydrase isoforms I, II, IX and XII. Bioorg Med Chem Lett 25:3208-12 (2015)  
Target
Name:
Carbonic anhydrase 9
Synonyms:
CA-IX CAH9_HUMAN Carbonic anhydrase 9 (CA IX) Carbonic anhydrase 9 precursor Carbonic anhydrase IX (CAIX) Carbonic anhydrases; II & IX MN RCC-associated antigen G250
Type:
Enzyme
Mol. Mass.:
49669.03
Organism:
Homo sapiens (Human)
Description:
Catalytic domain of human cloned isozyme was used in the assay
Residue:
459
  
Inhibitor
Name:
BDBM50107370
Synonyms:
CHEMBL3601464
Type:
Small organic molecule
Emp. Form.:
C21H19BrClN5O3S
Mol. Mass.:
536.829
SMILES:
CC(=O)N1N=C(CC1c1c(C)nn(c1Cl)-c1ccc(cc1)S(N)(=O)=O)c1ccc(Br)cc1
: