Target
Carbonic anhydrase 2
Ligand
BDBM50107371
Substrate
Meas. Tech.
ChEMBL_1509204 (CHEMBL3602837)
Ki
0.260000±n/a nM
Citation
 Khloya, PCeruso, MRam, SSupuran, CTSharma, PK Sulfonamide bearing pyrazolylpyrazolines as potent inhibitors of carbonic anhydrase isoforms I, II, IX and XII. Bioorg Med Chem Lett 25:3208-12 (2015)  
Target
Name:
Carbonic anhydrase 2
Synonyms:
CA-II CAC Carbonate dehydratase II Carbonic anhydrase 2 (CA-II) Carbonic anhydrase C Carbonic anhydrase II (CA-II) Carbonic anhydrase II (hCA II) | Carbonic anhydrase isoenzyme II (hCA II)
Type:
Enzyme
Mol. Mass.:
29250.71
Organism:
Homo sapiens (Human)
Description:
P00918
Residue:
260
  
Inhibitor
Name:
BDBM50107371
Synonyms:
CHEMBL3601463
Type:
Small organic molecule
Emp. Form.:
C21H19Cl2N5O3S
Mol. Mass.:
492.378
SMILES:
CC(=O)N1N=C(CC1c1c(C)nn(c1Cl)-c1ccc(cc1)S(N)(=O)=O)c1ccc(Cl)cc1
: