Target
Protein Mdm4
Ligand
BDBM162123
Substrate
Meas. Tech.
ChEMBL_1509591 (CHEMBL3603474)
IC50
2000±n/a nM
Citation
 Holzer, PMasuya, KFuret, PKallen, JValat-Stachyra, TFerretti, SBerghausen, JBouisset-Leonard, MBuschmann, NPissot-Soldermann, CRynn, CRuetz, SStutz, SChène, PJeay, SGessier, F Discovery of a Dihydroisoquinolinone Derivative (NVP-CGM097): A Highly Potent and Selective MDM2 Inhibitor Undergoing Phase 1 Clinical Trials in p53wt Tumors. J Med Chem 58:6348-58 (2015)  
Target
Name:
Protein Mdm4
Synonyms:
Double minute 4 protein MDM2-MDMX MDM4_HUMAN Mdm2-like p53-binding protein Protein Mdmx p53-binding protein | p53-binding protein Mdm4
Type:
Oncoprotein
Mol. Mass.:
54842.04
Organism:
Homo sapiens (Human)
Description:
The HDMX(1-188) were expressed in Escherichia coli BL21 (DE3) as a GST fusion and purified on glutathione sepharose.
Residue:
490
  
Inhibitor
Name:
BDBM162123
Synonyms:
US9051279, 106
Type:
Small organic molecule
Emp. Form.:
C38H47ClN4O4
Mol. Mass.:
659.257
SMILES:
COc1cc2CC(=O)N([C@@H](c3ccc(Cl)cc3)c2cc1OC(C)C)c1ccc(cc1)N(C)C[C@H]1CC[C@@H](CC1)N1CCN(C)C(=O)C1
: