Target
Acetylcholinesterase
Ligand
BDBM50108601
Substrate
Meas. Tech.
ChEMBL_1507873 (CHEMBL3598884)
IC50
1660000±n/a nM
Citation
 Valiveti, AKBhalerao, UMAcharya, JKarade, HNAcharya, BNRaviraju, GHalve, AKKaushik, MP Synthesis and in vitro kinetic evaluation of N-thiazolylacetamido monoquaternary pyridinium oximes as reactivators of sarin, O-ethylsarin and VX inhibited human acetylcholinesterase (hAChE). Bioorg Med Chem 23:4899-910 (2015)  
Target
Name:
Acetylcholinesterase
Synonyms:
ACES_HUMAN Acetylcholinesterase (AChE) | Acetylcholinesterase (human AChE)
Type:
Enzyme
Mol. Mass.:
67792.70
Organism:
Homo sapiens (Human)
Description:
P22303
Residue:
614
  
Inhibitor
Name:
BDBM50108601
Synonyms:
CHEMBL3597944
Type:
Small organic molecule
Emp. Form.:
C18H17IN4O3S
Mol. Mass.:
496.322
SMILES:
[I-].COc1ccc(cc1)-c1csc(NC(=O)C[n+]2ccc(\C=N\O)cc2)n1
: