Target
Mu-type opioid receptor
Ligand
BDBM21015
Substrate
Meas. Tech.
ChEMBL_1507463 (CHEMBL3599488)
Ki
0.560000±n/a nM
Citation
 Lefever, MLi, YAnglin, BMuthu, DGiuvelis, DLowery, JJKnapp, BIBidlack, JMBilsky, EJPolt, R Structural Requirements for CNS Active Opioid Glycopeptides. J Med Chem 58:5728-41 (2015)  
Target
Name:
Mu-type opioid receptor
Synonyms:
M-OR-1 MOR-1 MUOR1 Mu opiate receptor OPRM1 hMOP | mu-type opioid receptor isoform MOR-1
Type:
G Protein-Coupled Receptor (GPCR)
Mol. Mass.:
44789.51
Organism:
Homo sapiens (Human)
Description:
P35372
Residue:
400
  
Inhibitor
Name:
BDBM21015
Synonyms:
(2S)-2-{2-[(2R)-2-[(2S)-2-amino-3-(4-hydroxyphenyl)propanamido]propanamido]-N-methylacetamido}-N-(2-hydroxyethyl)-3-phenylpropanamide CHEMBL38874 DAMGO US11492374, ID 2 [tyrosyl-3,5-3H(N)]-D-Ala2-Mephe4-glyol5-enkephalin
Type:
Analgesics
Emp. Form.:
C26H35N5O6
Mol. Mass.:
513.586
SMILES:
C[C@@H](NC(=O)[C@@H](N)Cc1ccc(O)cc1)C(=O)NCC(=O)N(C)[C@@H](Cc1ccccc1)C(=O)NCCO
: