Target
Breakpoint cluster region protein/Tyrosine-protein kinase ABL1
Ligand
BDBM50322535
Substrate
Meas. Tech.
ChEMBL_1511918 (CHEMBL3606399)
IC50
0.900000±n/a nM
Citation
 Lu, XZhang, ZRen, XPan, XWang, DZhuang, XLuo, JYu, RDing, K Hybrid pyrimidine alkynyls inhibit the clinically resistance related Bcr-Abl(T315I) mutant. Bioorg Med Chem Lett 25:3458-63 (2015)  
Target
Name:
Breakpoint cluster region protein/Tyrosine-protein kinase ABL1
Synonyms:
Bcr-Abl Breakpoint cluster region protein /Tyrosine-protein kinase ABL | Tyrosine-protein kinase ABL1/Breakpoint cluster region protein
Type:
Enzyme
Mol. Mass.:
Description:
Components:
This complex has 2 components.
Component 1
Name:
Tyrosine-protein kinase ABL1
Synonyms:
ABL ABL1_HUMAN JTK7 Proto-oncogene tyrosine-protein kinase ABL1 Tyrosine-protein kinase ABL V-abl Abelson murine leukemia viral oncogene homolog 1 p150 | tyrosine-protein kinase ABL1 isoform a
Type:
Enzyme
Mol. Mass.:
122897.30
Organism:
Homo sapiens (Human)
Description:
P00519
Residue:
1130
  
Component 2
Name:
Breakpoint cluster region protein
Synonyms:
BCR BCR_HUMAN Breakpoint cluster region protein | D22S11
Type:
PROTEIN
Mol. Mass.:
142824.75
Organism:
Homo sapiens (Human)
Description:
ChEMBL_305348
Residue:
1271
  
Inhibitor
Name:
BDBM50322535
Synonyms:
3-(imidazo[1,2-b]pyridazin-3-ylethynyl)-4-methyl-N-{4-[(4-methylpiperazin-1-yl)methyl]-3-(trifluoromethyl)phenyl}benzamide CHEMBL1171837 US10464902, Ponatinib | US9255107, AP24534
Type:
Small organic molecule
Emp. Form.:
C29H27F3N6O
Mol. Mass.:
532.5595
SMILES:
CN1CCN(Cc2ccc(NC(=O)c3ccc(C)c(c3)C#Cc3cnc4cccnn34)cc2C(F)(F)F)CC1
: