Target
DNA (cytosine-5)-methyltransferase 3A
Ligand
BDBM50110805
Substrate
Meas. Tech.
ChEMBL_1510405 (CHEMBL3607245)
EC50
2100±n/a nM
Citation
 Erdmann, AMenon, YGros, CMolinier, NNovosad, NSamson, AGregoire, JMLong, CAusseil, FHalby, LArimondo, PB Design and synthesis of new non nucleoside inhibitors of DNMT3A. Bioorg Med Chem 23:5946-53 (2015)  
Target
Name:
DNA (cytosine-5)-methyltransferase 3A
Synonyms:
DNA (cytosine-5)-methyltransferase 3A DNA methyltransferase HsaIIIA DNMT3A M.HsaIIIA | tyrosine-protein phosphatase non-receptor type 12 isoform 2
Type:
PROTEIN
Mol. Mass.:
101857.24
Organism:
Homo sapiens (Human)
Description:
ChEMBL_1510405
Residue:
912
  
Inhibitor
Name:
BDBM50110805
Synonyms:
CHEMBL3605964
Type:
Small organic molecule
Emp. Form.:
C16H16ClN5O2
Mol. Mass.:
345.784
SMILES:
CCOCC(C(=O)c1ccc(Cl)cc1)n1cnc2ncnc(N)c12
: