Target
Isocitrate dehydrogenase [NADP] cytoplasmic
Ligand
BDBM50111796
Substrate
Meas. Tech.
ChEMBL_1510692 (CHEMBL3606178)
Kd
46000±n/a nM
Citation
 Wu, FJiang, HZheng, BKogiso, MYao, YZhou, CLi, XNSong, Y Inhibition of Cancer-Associated Mutant Isocitrate Dehydrogenases by 2-Thiohydantoin Compounds. J Med Chem 58:6899-908 (2015)  
Target
Name:
Isocitrate dehydrogenase [NADP] cytoplasmic
Synonyms:
Cytosolic NADP-isocitrate dehydrogenase IDH1 IDP Isocitrate dehydrogenase 1 (IDH1) Oxalosuccinate decarboxylase | PICD
Type:
Protein
Mol. Mass.:
46661.29
Organism:
Homo sapiens (Human)
Description:
O75874
Residue:
414
  
Inhibitor
Name:
BDBM50111796
Synonyms:
CHEMBL3605384
Type:
Small organic molecule
Emp. Form.:
C9H7N3O2S
Mol. Mass.:
221.236
SMILES:
O=C1NC(=S)N\C1=C\c1ccc(=O)[nH]c1
: