Target
Epithelial discoidin domain-containing receptor 1
Ligand
BDBM50112613
Substrate
Meas. Tech.
ChEMBL_1513726 (CHEMBL3610836)
IC50
150±n/a nM
Citation
 Murray, CWBerdini, VBuck, IMCarr, MECleasby, ACoyle, JECurry, JEDay, JEDay, PJHearn, KIqbal, ALee, LYMartins, VMortenson, PNMunck, JMPage, LWPatel, SRoomans, SSmith, KTamanini, ESaxty, G Fragment-Based Discovery of Potent and Selective DDR1/2 Inhibitors. ACS Med Chem Lett 6:798-803 (2015)  
Target
Name:
Epithelial discoidin domain-containing receptor 1
Synonyms:
CAK DDR1_HUMAN Discoidin domain-containing receptor 1 (DDR1) EDDR1 Epithelial discoidin domain receptor 1 (DDR1) Epithelial discoidin domain-containing receptor 1 (DDR1) Mammary carcinoma kinase 10 NTRK4 Protein-tyrosine kinase RTK 6 TRKE | Tyrosine-protein kinase CAK
Type:
Tyrosine-protein kinase
Mol. Mass.:
101130.02
Organism:
Homo sapiens (Human)
Description:
Q08345
Residue:
913
  
Inhibitor
Name:
BDBM50112613
Synonyms:
CHEMBL3608784
Type:
Small organic molecule
Emp. Form.:
C22H19N5O2
Mol. Mass.:
385.4186
SMILES:
O=C(NCc1cccc(NC(=O)c2cnc3ccccn23)c1)Nc1ccccc1
: