Target
Cytochrome P450 1A1
Ligand
BDBM50113269
Substrate
Meas. Tech.
ChEMBL_1508786 (CHEMBL3603195)
Ki
12000±n/a nM
Citation
 Liu, JPham, PTSkripnikova, EVZheng, SLovings, LJWang, YGoyal, NBellow, SMMensah, LMChatters, AJBratton, MRWiese, TEZhao, MWang, GForoozesh, M A Ligand-Based Drug Design. Discovery of 4-Trifluoromethyl-7,8-pyranocoumarin as a Selective Inhibitor of Human Cytochrome P450 1A2. J Med Chem 58:6481-93 (2015)  
Target
Name:
Cytochrome P450 1A1
Synonyms:
CP1A1_HUMAN CYPIA1 Cytochrome P450 1A1 P450 form 6 P450-P1
Type:
Protein
Mol. Mass.:
58177.23
Organism:
Homo sapiens (Human)
Description:
P04798
Residue:
512
  
Inhibitor
Name:
BDBM50113269
Synonyms:
CHEMBL3601441
Type:
Small organic molecule
Emp. Form.:
C18H12O3
Mol. Mass.:
276.2861
SMILES:
Cc1cc2c(ccc3c(cc(=O)oc23)-c2ccccc2)o1
: