Target
Cytochrome P450 1B1
Ligand
BDBM50113275
Substrate
Meas. Tech.
ChEMBL_1508788 (CHEMBL3603197)
Ki
30100±n/a nM
Citation
 Liu, JPham, PTSkripnikova, EVZheng, SLovings, LJWang, YGoyal, NBellow, SMMensah, LMChatters, AJBratton, MRWiese, TEZhao, MWang, GForoozesh, M A Ligand-Based Drug Design. Discovery of 4-Trifluoromethyl-7,8-pyranocoumarin as a Selective Inhibitor of Human Cytochrome P450 1A2. J Med Chem 58:6481-93 (2015)  
Target
Name:
Cytochrome P450 1B1
Synonyms:
CP1B1_HUMAN CYPIB1 | Cytochrome P450 1B1 (CYP1B1)
Type:
PROTEIN
Mol. Mass.:
60861.81
Organism:
Homo sapiens (Human)
Description:
ChEMBL_1474523
Residue:
543
  
Inhibitor
Name:
BDBM50113275
Synonyms:
CHEMBL3601511
Type:
Small organic molecule
Emp. Form.:
C16H10O4
Mol. Mass.:
266.2482
SMILES:
O=c1cc(-c2ccccc2)c2ccc3OCOc3c2o1
: