Target
Metabotropic glutamate receptor 5
Ligand
BDBM50113474
Substrate
Meas. Tech.
ChEMBL_1510803 (CHEMBL3606567)
IC50
5.0±n/a nM
Citation
 Christopher, JAAves, SJBennett, KADoré, ASErrey, JCJazayeri, AMarshall, FHOkrasa, KSerrano-Vega, MJTehan, BGWiggin, GRCongreve, M Fragment and Structure-Based Drug Discovery for a Class C GPCR: Discovery of the mGlu5 Negative Allosteric Modulator HTL14242 (3-Chloro-5-[6-(5-fluoropyridin-2-yl)pyrimidin-4-yl]benzonitrile). J Med Chem 58:6653-64 (2015)  
Target
Name:
Metabotropic glutamate receptor 5
Synonyms:
GPRC1E GRM5_HUMAN metabotropic glutamate 5 | metabotropic glutamate 5a
Type:
Enzyme
Mol. Mass.:
132484.72
Organism:
Homo sapiens (Human)
Description:
Residue:
1212
  
Inhibitor
Name:
BDBM50113474
Synonyms:
CHEMBL3603921 US10584111, Ex No. 19 | US11584732, Example 19
Type:
Small organic molecule
Emp. Form.:
C17H11ClN4
Mol. Mass.:
306.749
SMILES:
Cc1ccc(nc1)-c1cc(ncn1)-c1cc(Cl)cc(c1)C#N
: