Target
5-hydroxytryptamine receptor 2B
Ligand
BDBM50114873
Substrate
Meas. Tech.
ChEMBL_1512579 (CHEMBL3610528)
Ki
307±n/a nM
Citation
 Kapadia, NHarding, WW C4 phenyl aporphines with selective h5-HT(2B) receptor affinity. Bioorg Med Chem Lett 25:3451-4 (2015)  
Target
Name:
5-hydroxytryptamine receptor 2B
Synonyms:
5-HT-2B 5-hydroxytryptamine (serotonin) receptor 2B [Homo sapiens] 5-hydroxytryptamine receptor 2C (5HT2C) HTR2B Serotonin 2b (5-HT2b) receptor | Serotonin Receptor 2B
Type:
G Protein-Coupled Receptor (GPCR)
Mol. Mass.:
54312.47
Organism:
Homo sapiens (Human)
Description:
Receptor binding assays were performed using human clone stably expressed in CHO cells.
Residue:
481
  
Inhibitor
Name:
BDBM50114873
Synonyms:
CHEMBL3609140
Type:
Small organic molecule
Emp. Form.:
C28H29NO4
Mol. Mass.:
443.5342
SMILES:
CCCOc1c(OC)cc2C(CN(C)C3Cc4cc5OCOc5cc4-c1c23)c1ccccc1
: