Target
5-hydroxytryptamine receptor 1B
Ligand
BDBM50249134
Substrate
Meas. Tech.
ChEMBL_1512582 (CHEMBL3610629)
Ki
0.316228±n/a nM
Citation
 Kapadia, NHarding, WW C4 phenyl aporphines with selective h5-HT(2B) receptor affinity. Bioorg Med Chem Lett 25:3451-4 (2015)  
Target
Name:
5-hydroxytryptamine receptor 1B
Synonyms:
5-HT-1B 5-HT1B 5HT1B_HUMAN HTR1DB Serotonin (5-HT) receptor Serotonin Receptor 1B
Type:
G Protein-Coupled Receptor (GPCR)
Mol. Mass.:
43579.17
Organism:
Homo sapiens (Human)
Description:
Receptor binding assays were performed using human clone stably expressed in CHO cells
Residue:
390
  
Inhibitor
Name:
BDBM50249134
Synonyms:
4-(4-fluoronaphthalen-1-yl)-6-isopropylpyrimidin-2-amine RS-127445
Type:
Small organic molecule
Emp. Form.:
C17H16FN3
Mol. Mass.:
281.3274
SMILES:
CC(C)c1cc(nc(N)n1)-c1ccc(F)c2ccccc12
: